Quellennachweis Koch 2009
type: NamedIndividual
type: ConceptScheme

Begriffe für den Themenkomplex Sakralbau
type: NamedIndividual
type: ConceptScheme

Strukturtypen
type: NamedIndividual
type: ConceptScheme

Secco
alternative label: secco painting @en
alternative label: Trockenmalerei
alternative label: Secco-Malerei
alternative label: Al secco
alternative label: Seccomalerei
alternative label: Sekko-Technik
preferred label: pintura en seco @es
preferred label: pittura a secco @it
preferred label: secco @en
preferred label: al secco @cs
preferred label: peinture à secco @fr
type: Concept
type: NamedIndividual
created: 2019-07-19T23:01:06
broader: Wandmalereitechnik
definition: (ital. al secco ›auf dem Trockenen‹) Malen auf trockenem Putz im Gegensatz zum Fresko, das auf den noch feuchten Putz gemalt wird. Da sie weniger haltbar ist, wurde S. vor allem in Innenräumen verwendet. Ihr Vorteil ist, dass auch vorhandene Flächen und andere Trägermaterialien (Holz, Leinwand, Stein) bemalt werden können. Gerade die im Burgenbau vorkommende Wandmalerei, etwa die Fugenmalerei, Fensterumrahmungen, gemalte Friese und Ornamentmalerei, wurde häufig als S. aufgebracht. Bei vielen barocken Deckenmalereien, die als Fresko aufgebracht wurden, wurden mit Hilfe der S. noch zusätzlich Lichter aufgesetzt und Feinheiten eingearbeitet. B. Sch.-W. [Wörterbuch der Burgen, Schlösser und Festungen]
definition: Al-secco-Malerei (ital. secco = trocken), Wasserfarben auf trockener Wand. [Koch 2009]
definition: Im Gegensatz zur Freskomalerei eine Wandmalerei auf trockener Putzfläche. [Koepf / Binding 2016]
in scheme: Quellennachweis Koch 2009
in scheme: Bamberger Vokabular für Historische Architektur
in scheme: Begriffe für den Themenkomplex Sakralbau
in scheme: Strukturtypen
in scheme: Quellennachweis EwaGlos
modified: 2021-01-18T14:03:17
note: Bei dieser Wandmalereitechnik werden Pigmente in einem organischen Bindemittel und/oder in Kalk gebunden und auf einen trockenen Putz aufgetragen. [EwaGlos]
note: A wall painting technique where pigments mixed with an organic binder and /or lime are applied onto a dry plaster. [EwaGlos] @en

Quellennachweis EwaGlos
type: NamedIndividual
type: ConceptScheme

Bamberger Vokabular für Historische Architektur
type: NamedIndividual
type: ConceptScheme

Wandmalereitechnik
preferred label: wall painting @en
preferred label: nástěnná malba @cs
type: NamedIndividual
type: Concept
narrower: Secco