Quellennachweis Koch 2009
type: NamedIndividual
type: ConceptScheme

Begriffe für den Themenkomplex Sakralbau
type: NamedIndividual
type: ConceptScheme

Allegorie
type: NamedIndividual
type: Concept
narrower: Die Sieben Freien Künste

Die Sieben Freien Künste
in scheme: Quellennachweis Koch 2009
in scheme: Quellennachweis Koch 2008
in scheme: Begriffe für den Themenkomplex Sakralbau
in scheme: Bamberger Vokabular für Historische Architektur
broader: Allegorie
type: Concept
type: NamedIndividual
modified: 2021-01-22T10:23:56
preferred label: sedm svobodných umění @cs
created: 2020-08-12T13:07:29
definition: (lat. septem artes liberales), seit der karolingischen Zeit häufig dargestellte sieben weibliche Figuren mit Attributen. Sie personifizieren 1. das Trivium (daher »trivial«): Grammatik, Dialektik, Rhetorik, 2. das Quadrivium: Geometrie, Arithmetik, Musik, Astronomie. [Koch 2009]
definition: Lat. artes liberales, od karolínské doby často znázorňovaná jako sedm ženských postav s atributy, které perzonifikují 1. trivium (odtud „triviální"): gramatiku, dialektiku, rétoriku, 2. kvadrivium: geometrii, aritmetiku, hudbu a astronomii. [Koch 2008] @cs

Quellennachweis Koch 2008
type: NamedIndividual
type: ConceptScheme

Bamberger Vokabular für Historische Architektur
type: NamedIndividual
type: ConceptScheme