Quellennachweis Koch 2009
type: NamedIndividual
type: ConceptScheme

Quellennachweis Koepf / Binding 2016
type: NamedIndividual
type: ConceptScheme

Majolika
preferred label: majolika @cs
type: NamedIndividual
type: Concept
related: Fayence

Quellennachweis Koch 2008
type: NamedIndividual
type: ConceptScheme

Keramik
preferred label: keramika @cs
preferred label: ceramic @en
type: NamedIndividual
type: Concept
narrower: Fayence

Bamberger Vokabular für Historische Architektur
type: NamedIndividual
type: ConceptScheme

Fayence
definition: Franc., od Faenza, ital. hrnčířské město. Předem vypálené, většinou barevné výrobky jsou potaženy cínovou glazurou při ostrém výpalu. [Koch 2008] @cs
definition: Fayence (frz., von Faenza, ital. Töpferstadt): der vorgebrannte, meist farbige Scherben wird mit Zinnglasur bei Scharffeuer überschmolzen. [Koch 2009]
definition: Fayence (frz„ doch im Franz. heute faience geschrieben), nach der Stadt Faenza, einem der ersten ital. Herstellungsorte der F. benanntes Erzeugnis aus gebranntem Ton, das mit einer meist weißen und mit Scharffeuerfarben bemalten Glasur aus Zinn oder Blei überschmolzen ist. Das Verfahren wurde schon im Altertum von den Ägyptern, Babyloniern und Assyrern für ihre Baukeramik angewandt, gelangte durch Vermittlung der Araber im 14. Jh. nach Europa (Azulejos) und findet noch heute als Wandschmuck und Baudekoration, v. a. aber im Kunstgewerbe vielseitige Verwendung. [Koepf / Binding 2016]
preferred label: fajáns @cs
broader: Keramik
type: NamedIndividual
type: Concept
in scheme: Quellennachweis Koch 2009
in scheme: Quellennachweis Koepf / Binding 2016
in scheme: Bamberger Vokabular für Historische Architektur
in scheme: Quellennachweis Koch 2008
modified: 2020-09-14T09:37:47
created: 2020-08-06T10:28:19
related: Majolika