Schwalbenschwanz(einlage)
preferred label: queue d\'aronde @fr
preferred label: dovetail @en
preferred label: ensambladura a cola de milano @es
preferred label: rybina @cs
preferred label: coda di rondine @it
modified: 2021-01-22T14:38:07
definition: Trapezförmige Ausbildung zur zugfesten Verbindung zweier Hölzer, bei der der Ansatz schmäler ist als das Kopfende. [Koepf / Binding 2016]
definition: Schwalbenschwanzeinlagen werden zur Verbindung parallel zueinander gelegter oder in Längsrichtung stumpf aneinanderstoßender Hölzer eingesetzt. Sie besitzen eine gegenständige Ausformung und können Zugkräfte übertragen. (Eißing et al. 2012)
in scheme: Bamberger Vokabular für Historische Architektur
in scheme: Quellennachweis Eißing et al. 2012
in scheme: Strukturtypen
type: NamedIndividual
type: Concept
created: 2019-05-14T10:30:46
broader: Verbindung

Strukturtypen
type: NamedIndividual
type: ConceptScheme

Quellennachweis Eißing et al. 2012
type: NamedIndividual
type: ConceptScheme

Bamberger Vokabular für Historische Architektur
type: NamedIndividual
type: ConceptScheme

Verbindung
preferred label: spojení @cs
type: NamedIndividual
type: Concept
narrower: Schwalbenschwanz(einlage)