Quellennachweis Koepf / Binding 2016
type: NamedIndividual
type: ConceptScheme

Strukturtypen
type: NamedIndividual
type: ConceptScheme

Pendentifkuppel
alternative label: coupole byzantine @fr
alternative label: Byzantinische Kuppel
alternative label: Zwickelkuppel
alternative label: coupole à pendentifs @fr
alternative label: Byzantinerkuppel
preferred label: kupole na pendentivech @cs
preferred label: coupole sur pendentifs @fr
preferred label: Byzantine dome @en
broader by construction: Kuppel
in scheme: Quellennachweis Koepf / Binding 2016
in scheme: Bamberger Vokabular für Historische Architektur
in scheme: Strukturtypen für Sakralbauten
in scheme: Strukturtypen
created: 2019-12-18T15:03:35
definition: Kuppel, die über den vier verbleibenden Abschnitten einer angeschnittenen Hängekuppel, den Pendentifs, errichtet ist. Im Unterschied zur Hängekuppel ist die Gewölbelinie der Pendentifs hier anders als die der Kuppel. Eine Sonderform der Pendentifkuppel ist die Aquitanische Kuppel, bei der die Pendentifs horizontale Lagerfugen haben. (Glossarium Artis)
definition: Byzantinische Kuppel, geschlossene Kugelkuppel oder Kalotte über abgekappter Hängekuppel bzw. flachen Pendentifs. [Koepf / Binding 2016]
broader: Kuppel
type: Concept
type: NamedIndividual
modified: 2021-01-19T12:34:38

Strukturtypen für Sakralbauten
type: NamedIndividual
type: ConceptScheme

Bamberger Vokabular für Historische Architektur
type: NamedIndividual
type: ConceptScheme

Kuppel
preferred label: kupole @cs
preferred label: coupole @fr
type: NamedIndividual
type: Concept
narrower: Pendentifkuppel