Quellennachweis Koch 2009
type: NamedIndividual
type: ConceptScheme

Altarretabelelement
type: NamedIndividual
type: Concept
related: Flügelretabel

Quellennachweis Koepf / Binding 2016
type: NamedIndividual
type: ConceptScheme

Altarretabel
preferred label: retablo @es
preferred label: retable @fr
preferred label: oltářní retábl @cs
type: NamedIndividual
type: Concept
narrower: Flügelretabel

kleinformatiges Retabel
type: NamedIndividual
type: Concept
broader: Flügelretabel

Strukturtypen
type: NamedIndividual
type: ConceptScheme

Strukturtypen für Sakralbauten
type: NamedIndividual
type: ConceptScheme

Quellennachweis Koch 2008
type: NamedIndividual
type: ConceptScheme

Wandelaltar
preferred label: proměnný oltář @cs
preferred label: pentaptyque @fr
preferred label: altar con aletas modificable @es
type: NamedIndividual
type: Concept
broader: Flügelretabel

Bamberger Vokabular für Historische Architektur
type: NamedIndividual
type: ConceptScheme

Flügelretabel
preferred label: křídlový retábl @cs
preferred label: winged altarpiece @en
preferred label: polyptique @fr
preferred label: polittico @it
in scheme: Bamberger Vokabular für Historische Architektur
in scheme: Quellennachweis Koepf / Binding 2016
in scheme: Strukturtypen
in scheme: Quellennachweis RDK Labor
in scheme: Quellennachweis Koch 2008
in scheme: Strukturtypen für Sakralbauten
in scheme: Quellennachweis Koch 2009
narrower: Wandelaltar
narrower: großformatiges Retabel
narrower: kleinformatiges Retabel
related: Retabelreliquiar
related: Altarretabelelement
alternative label: polyptych @en
alternative label: retable aux volets @fr
alternative label: Schnitzretabel
alternative label: altare a portelli @it
alternative label: Klappretabel
alternative label: Wandelretabel
alternative label: křídlový oltář @cs
alternative label: Flügelaltar
definition: Der Flügelaltar hat seine Blütezeit im 15.-16. Jh., besonders in Deutschland, den Niederlanden, NO-Frankreich, Skandinavien. Bei ihm dient eine Predella (Altarstaffel auf der Mensa) als Reliquiengrab und als Untersatz für den feststehenden Altarschrein. Diesem sind links und rechts Flügel angesetzt. Schrein, Flügel und meist auch Predella werden mitgeschnitzten (Schnitzaltar) oder gemalten Bildern versehen.Mit mehreren Flügelpaaren lassen sich die Ansichten abwandeln (Wandelaltar). Spätgotische Schreine tragen ein Gesprenge, eine zierlich-durchsichtige Anordnung von dünnen Stäben, mit Krabben besetzten Fialen, auch Konsolfiguren unter Baldachinen. [Koch 2009]
definition: Byl nejvíce rozšířen v 15.-16. stol., především v Německu, Nizozemsku, severovýchodní Francii a Skandinávii. [Koch 2008] @cs
definition: Hauptsächl. von der dt. Gotik entwickelte Form des Altarretabels. Der F. besteht aus einem feststehenden, meisthölzernen Mittelteil, dem Altarschrein, an dem rechts und linksbewegl. Flügel aus Holz angebracht sind. Schrein und Flügelsind mit geschnitzten (Schnitzaltar) oder gemalten Darstellungen versehen, doch sind die Flügel an ihrer Außenseite meist nur bemalt, so dass der F., wenn er geschlossen ist, lediglich Gemälde zeigt. Statt des einen Flügelpaares kann der Schrein auch mehrere Flügel haben, was einen mehrfachen Wandel der Ansichten ermöglicht (Wandelaltar). Im 15. Jh. und später wird der F. mit einem Untersatz in der Breite des Schreins versehen, der Predellaoder Altarstaffel, die meist auch mit geschnitzten oder gemalten Darstellungen ausgestattet ist und in der Mitte ein Gehäuse zur Aufnahme des Hostienbehälters haben kann. In der Spätgotik erhält der Schrein vielfach einen hohen,turmartigen Aufbau, das Gesprenge, ein Gebilde aus zierl. und dünnen Architekturgliedern, auch mit geschnitzten Figuren besetzt. [Koepf / Binding 2016]
definition: Das Flügelretabel ist ein Altarretabel, das mit beweglichen Flügeln versehen ist und dessen Mittelteil (Tafel, Schrein) geschlossen und geöffnet werden kann, um die Schauseite zu verändern. [RDK Labor]
type: Concept
type: NamedIndividual
modified: 2021-01-31T00:00:03
created: 2020-02-26T11:26:03
broader: Altarretabel
scope note: In der Literatur findet sich oft der irreführende Begriff des "Flügelaltars". Dieser beschreibt jedoch keine Altarform, sondern ist synonym für das Flügelretabel zu verstehen.

Quellennachweis RDK Labor
type: NamedIndividual
type: ConceptScheme

großformatiges Retabel
preferred label: velkoformátový retábl @cs
type: NamedIndividual
type: Concept
broader: Flügelretabel

Retabelreliquiar
preferred label: rétable-reliquaire @fr
preferred label: reredos-reliquary @en
type: NamedIndividual
type: Concept
related: Flügelretabel