Quellennachweis Koch 2009
type: NamedIndividual
type: ConceptScheme

Quellennachweis Koepf / Binding 2016
type: NamedIndividual
type: ConceptScheme

Strukturtypen
type: NamedIndividual
type: ConceptScheme

Decke
preferred label: strop @cs
type: NamedIndividual
type: Concept
narrower: Artesonado

Quellennachweis Koch 2008
type: NamedIndividual
type: ConceptScheme

Bamberger Vokabular für Historische Architektur
type: NamedIndividual
type: ConceptScheme

Artesonado
created: 2020-08-03T12:49:12
in scheme: Strukturtypen
in scheme: Quellennachweis Koch 2008
in scheme: Quellennachweis Koch 2009
in scheme: Quellennachweis Koepf / Binding 2016
in scheme: Bamberger Vokabular für Historische Architektur
definition: ARTESONADO, španělský název pro maurské táflované stropy a dveře složené z četných, často barevných kusů dřeva, které vytvářejí umělecky proplétané geometrické vzory se zahloubenými poli (artesón = mísa), rovněž ze štuku. [Koch 2008] @cs
definition: Span. Bezeichnung für das kunstvolle Täfelwerk maur. Decken und Türen, bestehend aus vielen Hölzern, die zu geometr. Mustern mit vertieften Feldern (artesón: Becken) zusammengefügt sind. [Koepf / Binding 2016]
definition: Spanischer Name für maurische Täfeldecken und -türen aus zahlreichen, oft farbigen Hölzern, die kunstvoll verschlungene geometrische Muster mit vertieften Feldern (artesón = Becken) bilden. Auch aus Stuck. [Koch 2009]
type: Concept
type: NamedIndividual
modified: 2020-09-02T15:01:20
preferred label: artesonado @cs
broader: Decke