Quellennachweis Koch 2009
type: NamedIndividual
type: ConceptScheme

Triglyphenelement
type: NamedIndividual
type: Concept
broader: Triglyph

Bauornament
type: NamedIndividual
type: Concept
narrower: Triglyph

Triglyph
preferred label: tríglifo @it
preferred label: triglyphe @fr
preferred label: triglyf @cs
preferred label: triglyph @en
narrower: tríglifo de dos canales
narrower: Triglyphenelement
definition: Řec. trojštěrbina. Stavební prvek u dórského kladí se 2 středními a 2 „polovičními" bočními zářezy (glyfy) a krycí deskou (lat. capitula = hlavička). [Koch 2008] @cs
definition: Dreischlitzplatte am Fries der Dorischen Ordnung. Die T.n sind als im Steinbau nachgebildete Balkenköpfe zu verstehen. Ohne seitl. Halbschlitze nennt man diesen Balkenkopf Diglyph. [Koepf /Binding 2016]
definition: Triglyph, -e (griech. Dreischlitz), Bauglied am dorischen Gebälk mit 2 mittleren und 2 »halben« seitlichen Einkerbungen (Glyphen) und Deckplatte (lat. capitula = Kapitellchen). [Koch 2009]
type: Concept
type: NamedIndividual
in scheme: Strukturtypen
in scheme: Bamberger Vokabular für Historische Architektur
in scheme: Quellennachweis Koch 2009
in scheme: Quellennachweis Koch 2008
modified: 2021-01-25T13:37:52
created: 2020-08-03T14:26:52
broader: Bauornament

Strukturtypen
type: NamedIndividual
type: ConceptScheme

Quellennachweis Koch 2008
type: NamedIndividual
type: ConceptScheme

Bamberger Vokabular für Historische Architektur
type: NamedIndividual
type: ConceptScheme

tríglifo de dos canales
preferred label: diglyphe @fr
preferred label: diglyf @cs
preferred label: diglifo
type: NamedIndividual
type: Concept
broader: Triglyph