Proportionslehre
preferred label: proporční systém @cs
type: NamedIndividual
type: Concept
narrower: Triangulation

Quellennachweis Koepf / Binding 2016
type: NamedIndividual
type: ConceptScheme

Begriffe für den Themenkomplex Sakralbau
type: NamedIndividual
type: ConceptScheme

Triangulation
in scheme: Begriffe für den Themenkomplex Sakralbau
in scheme: Quellennachweis Koepf / Binding 2016
in scheme: Quellennachweis Koch 2008
in scheme: Bamberger Vokabular für Historische Architektur
definition: Triangulatur, Proportionsschlüssel zur Bestimmung der Maßverhältnisse: Ein gleichseitiges Dreieck, dem ein zweites diagonal einbeschrieben ist usw., dient zur Festlegung von Baumaßen mit Zirkel und Richtscheit. Wie weit tatsächl. die T. bei der Bemessung got. Bauten maßgebend war, ist umstritten. [Koepf / Binding 2016]
definition: Použití rovnostranného trojúhelníku k určení konstrukčně důležitých bodů, patrně již v gotice, určitě však za renesance a v době baroka (,,borrominiovské trojúhelníky", srov. Řím, St. Ivo. [Koch 2008] @cs
type: NamedIndividual
type: Concept
preferred label: triangolazione @it
preferred label: triangulación @es
preferred label: triangulation @fr
preferred label: triangulace @cs
modified: 2021-01-15T18:02:25
created: 2020-08-07T12:08:03
broader: Proportionslehre

Quellennachweis Koch 2008
type: NamedIndividual
type: ConceptScheme

Bamberger Vokabular für Historische Architektur
type: NamedIndividual
type: ConceptScheme