Quellennachweis ICOMOS-ISCS
type: NamedIndividual
type: ConceptScheme

Schaden der Architekturoberfläche
type: NamedIndividual
type: Concept
narrower: Graffiti

Begriffe für Bauerhalt
type: NamedIndividual
type: ConceptScheme

Graffiti
in scheme: Begriffe für Bauerhalt
in scheme: Quellennachweis ICOMOS-ISCS
in scheme: Bamberger Vokabular für Historische Architektur
type: NamedIndividual
type: Concept
definition: Einritzen, Kratzen, Schneiden oder Aufsprühen von Farbe, Tinte oder ähnlichem auf die Steinoberfläche.[ICOMOS-ISCS]
definition: Forme d’altération superficielle résultant d’une incision, rayure ou application de peinture, encre ou matériau assimilé. [ICOMOS-ISCS] @fr
definition: Rytí, škrábání, vyřezávání nebo nanesení barvy,inkoustu nebo podobné hmoty na kamenný povrch;malba sprejem na zeď. [ICOMOS-ISCS] @cs
definition: Engraving, scratching, cutting or application of paint, ink or similar matter on the stone surface. [ICOMOS-ISCS] @en
preferred label: vandalské značkování @cs
preferred label: graffiti @fr
created: 2019-11-07T14:21:21
modified: 2021-01-30T17:48:45
broader: Schaden der Architekturoberfläche
alternative label: grafiti @cs

Bamberger Vokabular für Historische Architektur
type: NamedIndividual
type: ConceptScheme