Darstellungsinhalt
type: NamedIndividual
type: Concept
narrower: Erote

Quellennachweis Koch 2008
type: NamedIndividual
type: ConceptScheme

Bamberger Vokabular für Historische Architektur
type: NamedIndividual
type: ConceptScheme

Quellennachweis Wörterbuch der Burgen, Schlösser und Festungen
type: NamedIndividual
type: ConceptScheme

Erote
definition: Kinder mit Flügeln als kleine Erosgestalten. Im Hellenismus als Zugabe zu Plastiken beliebt, auch in Wandmalereien (Pompeji). Nach ihrem Vorbild entstanden die got. Kinderengel und die Putten in Renaissance und Barock. [Koch 2009]
definition: Děti s křídly v podobě malého Erata. V helénistické době oblíbený přídavek k plastikám, rovněž v nástěnných malbách (Pompeje). Podle jejich vzoru vznikli gotičtí andílkové a putti v době renesance a baroka. [Koch 2008] @cs
preferred label: erotové @cs
created: 2020-08-03T14:38:51
modified: 2021-01-27T09:55:51
in scheme: Bamberger Vokabular für Historische Architektur
in scheme: Quellennachweis Koch 2008
in scheme: Quellennachweis Wörterbuch der Burgen, Schlösser und Festungen
in scheme: Quellennachweis Koch 2009
broader: Darstellungsinhalt
type: NamedIndividual
type: Concept

Quellennachweis Koch 2009
type: NamedIndividual
type: ConceptScheme