Quellennachweis Koepf / Binding 2016
type: NamedIndividual
type: ConceptScheme

Gratsparren
in scheme: Bamberger Vokabular für Historische Architektur
in scheme: Quellennachweis Eißing et al. 2012
in scheme: Quellennachweis Koepf / Binding 2016
in scheme: Strukturtypen
preferred label: nárožní krokev @cs
broader: Sparren
definition: Der den Grat unterstützende, diagonal von der ausspringenden Ecke einer Traufe zum First verlaufende Sparren eines Walmdaches (Dachkonstruktion), dessen Oberfläche zwei, den beiden Dachflächen entsprechende, Neigungsflächen hat, deren Winkel nach außen weist (im Gegensatz dazu Kehlsparren). [Koepf / Binding 2016]
definition: Gratsparren/Gratrofen: Sparren/Rofen, der an der Nahtstelle schräg aneinanderstoßender Dachflächen verläuft; der Sparren- bzw. Rofenquerschnitt kann rhombisch ausgeformt sein. (Eißing et al. 2012)
modified: 2020-09-29T15:30:26
created: 2019-05-27T17:49:10
type: NamedIndividual
type: Concept

Strukturtypen
type: NamedIndividual
type: ConceptScheme

Quellennachweis Eißing et al. 2012
type: NamedIndividual
type: ConceptScheme

Bamberger Vokabular für Historische Architektur
type: NamedIndividual
type: ConceptScheme

Sparren
preferred label: spar @en
preferred label: puntone @it
preferred label: krokev @cs
preferred label: chevron @fr
preferred label: cabio @es
type: NamedIndividual
type: Concept
narrower: Gratsparren