Quellennachweis Koch 2009
type: NamedIndividual
type: ConceptScheme

Quellennachweis Koepf / Binding 2016
type: NamedIndividual
type: ConceptScheme

Archivolte
preferred label: archivolte @fr
preferred label: archivolta @cs
preferred label: archivolt @en
preferred label: arcus volutus @la
in scheme: Quellennachweis Koch 2009
in scheme: Quellennachweis Glossarium Artis
in scheme: Quellennachweis Koch 2008
in scheme: Quellennachweis Koepf / Binding 2016
in scheme: Strukturtypen
in scheme: Bamberger Vokabular für Historische Architektur
modified: 2021-01-22T17:11:57
definition: Archivolte (ital. vorderer Bogen), 1. die Stirn und die Laibung eines Rundbogens, als ein zum Halbkreis gebogener Architrav über Stützen zu verstehen (Antike, Romanik, Renaissance, Barock); 2. im romanischen und gotischen Gewändeportal jeder Bogenlauf, der die Gliederung der Gewände fortsetz, in der Romanik oft in Form eines Rundstabes. Diese Archivolten sind häufig mit Bänderfriesen (besonders in der Romanik) oder Figuren (Gotik) besetzt. [Koch 2009]
definition: Ursprünglich ein architravartig profilierter Bogen wie der Faszienbogen, im weiteren Sinne jeder durch besondere künstlerische Gestaltung (Steinsetzung, Profilierung, Ornamentierung) ausgezeichnete, über einem Durchgang gespannte Bogen. Die Bezeichnung gilt auch den in die Tiefe gestaffelten, oft mit Figuren geschmückten Bogenläufen an romanischen und gotischen Portalen, die gelegentlich, ohne dass ein Kämpfergesims ausgebildet wäre, unmittelbar in die Säulen und Pfosten des Gewändes übergehen. Man spricht dann auch von einem durchlaufenden Bogen. [Glossarium Artis]
definition: Archivolte (ital. archivolto: Ober-, Vorderbogen), 1. der Faszienbogen (Vignola), dann die durch künstler. Behandlung ausgezeichnete Stirnseite eines Bogens, von der Antike in die Renaissance übernommen. 2. Als A.n werden auch die Bogen im Gewände roman. und got. Portale bezeichnet, die hier die Fortsetzung der Gewändegliederung bilden und häufig mit Skulpturen (Archivoltenfiguren) besetzt sind. [Koepf / Binding 2016]
definition: l. Čelo a líc půlkruhového oblouku, vlastně architráv nad podporami ohnutý do půlkruhu (antika, románský sloh, renesance, baroko). 2. U románského a gotického portálu s šikmým ostěním každý oblouk, který pokračuje v členění šikmého ostění, v románském slohu často v podobě oblounu. Tyto archivolty jsou často osazeny pásovými vlysy (zvl. v románské době) nebo figurami (gotika). [Koch 2008] @cs
type: Concept
type: NamedIndividual
alternative label: compound arch @en
alternative label: archivault @en
related: Archivoltenzone
created: 2019-10-21T11:57:42
broader: Portalelement
broader: Zierbogen

Strukturtypen
type: NamedIndividual
type: ConceptScheme

Archivoltenzone
type: NamedIndividual
type: Concept
related: Archivolte

Quellennachweis Glossarium Artis
type: NamedIndividual
type: ConceptScheme

Quellennachweis Koch 2008
type: NamedIndividual
type: ConceptScheme

Bamberger Vokabular für Historische Architektur
type: NamedIndividual
type: ConceptScheme

Portalelement
preferred label: část portálu @cs
type: NamedIndividual
type: Concept
narrower: Archivolte

Zierbogen
preferred label: decorated arch @en
preferred label: arc orné @fr
type: NamedIndividual
type: Concept
narrower: Archivolte