Quellennachweis Koch 2009
type: NamedIndividual
type: ConceptScheme

Begriffe für den Themenkomplex Sakralbau
type: NamedIndividual
type: ConceptScheme

Genius
modified: 2021-01-23T13:31:57
in scheme: Quellennachweis Koch 2008
in scheme: Begriffe für den Themenkomplex Sakralbau
in scheme: Quellennachweis Koch 2009
in scheme: Bamberger Vokabular für Historische Architektur
definition: Strážný duch člověka nebo určitého místa (genius loci) v antickém Římě představoval alegorii zplození a býval znázorňován v podobě hada, jinocha, nebo nahého okřídleného dítěte ve stylu erotů, strážná bohyně žen se jmenovala Juno. [Koch 2008] @cs
definition: Genius (lat., Mz. Genien), persönlicher Schutzgeist eines Mannes oder eines Ortes (Genius loci) im antiken Rom. Er ist eine Allegorie der Zeugung und wird als Schlange, Jüngling oder nacktes geflügeltes Kind in der Art von Eroten (Bauplastik) dargestellt. Die Schutzgöttin einer Frau heißt Juno. [Koch 2009]
type: Concept
type: NamedIndividual
created: 2020-08-05T11:25:32
preferred label: génius @cs
broader: Schutzgeist

Schutzgeist
type: NamedIndividual
type: Concept
narrower: Genius

Quellennachweis Koch 2008
type: NamedIndividual
type: ConceptScheme

Bamberger Vokabular für Historische Architektur
type: NamedIndividual
type: ConceptScheme