Quellennachweis Koch 2009
type: NamedIndividual
type: ConceptScheme

Quellennachweis Koepf / Binding 2016
type: NamedIndividual
type: ConceptScheme

Strukturtypen für Burgen und Schlösser
type: NamedIndividual
type: ConceptScheme

Galerie (Erschließung)
modified: 2021-01-27T15:30:59
in scheme: Bamberger Vokabular für Historische Architektur
in scheme: Quellennachweis Koch 2009
in scheme: Quellennachweis Koch 2008
in scheme: Quellennachweis Koepf / Binding 2016
in scheme: Strukturtypen für Burgen und Schlösser
in scheme: Strukturtypen
definition: (ital. galleria) An mittelalterlichen Bauten ein lang gestreckter, einseitig offener Gang, der einer Mauer oder Fassade vorgelegt ist. Mit Beginn der französischen Renaissance erhielt die G. ihre repräsentative Ausprägung und fand von nun an als fester Bestandteil Aufnahme in das bauliche Repertoire des neuzeitlichen Schlosses. Meist über Arkaden im Erdgeschoss liegend, nahm die G. den gesamten Raum eines Schlossflügels ein, so dass sie von zwei Seiten belichtet werden konnte. Die G. war beheizbar und einheitlich ausgestattet. Von Frühformen wie dem g.artigen Gang in Schloss Blois F bis zu der aufwändigen Ausführung der Spiegel-G. in Versailles F (1678–1684) bildet die G. einen wichtigen Teil des Schlosskomplexes. Im deutschen Schlossbau wird die G. häufig nur einseitig belichtet (Ludwigsburg BW). Da die G. meist mit reichem Bilderschmuck ausgestattet war, wurde der Name dieses Bauteils auf Gebäude mit Bildersammlungen übertragen.Im Festungsbau ist die G. ein gewölbter Gang hinter der Futtermauer; aus dessen Schießscharten konnte der Graben unter Feuer genommen werden. Einen solchen Gang in der inneren Grabenwand bezeichnet man als Eskarpen-G. und in der äußeren als Kontereskarpen-G.; die Letztere wurde besonders in den Systemen des 19. Jh.s verwendet. B. Sch.-W. / E. B. [Wörterbuch der Burgen, Schlösser und Festungen]
definition: Galerie (frz.), langer, gedeckter, einseitig offener Gang. 1. Als Laufgang an einer Fassade, auch als Zierform (Zwergg.). 2. Langgestreckter, einseitig belichteter Verbindungsgang in einem Schloss, auch zum Aufhängen von Bildern genutzt, übertragen allg. auf Sammlungsräume, insbes. für Gemälde (Museum). 3. Emporen- oder Balkonreihe in Theatern. 4. Vorgekragter Laufgang im nord. und alpenländ. Blockbau, von den aus den Außen- und Zwischenwänden herausstehenden Blockbalken, im Fachwerkbau von den verlängerten Deckenbalken getragen. Die Brüstung war urspr. verbrettert oder als Balusterreihe ausgebildet. 5. Im Festungsbau ein Minengang. 6. Im Städtebau glasgedeckte öffentl. Ladenstraßen, jedoch meist als Passage bezeichnet. 7. Seitl. offene, überwölbte oder mit Stahlbetonplatte abgedeckte Überbauung von Gebirgsstraßen zum Schutz gegen Lawinen und Steinschlag. [Koepf / Binding 2016]
definition: 1. Protáhlý reprezentační prostor v barokním zámku. 2. Vzhledem ke své světlosti často využita jako prostor pro vystavení uměleckých děl, dnes proto galerie znamená větší uměleckou sbírku (kabinet = menší sbírka), 3. Nejvyšší pořadí v divadle. 4. Zabudovaná empora. 5. Otevřená chodba u kostelů (trpasličí galerie, arkáda) nebo obranných objektů. [Koch 2008] @cs
narrower: Überzimmer
preferred label: galerie @cs
type: NamedIndividual
type: Concept
scope note: Galerie (frz.), 1. oberster Theaterrang; 2. eingebaute Empore; 3. offener Laufgang an Kirchen (Zwerggalerie, Arkade) oder Wehrbauten. [Koch 2009]
related: Loggia
related: Laube (Erschließung)
broader: Verbindungsbau
created: 2019-10-22T09:29:15

Überzimmer
preferred label: sporto in legno @it
preferred label: pieza sobresaliente de madera @es
type: NamedIndividual
type: Concept
broader: Galerie (Erschließung)

Strukturtypen
type: NamedIndividual
type: ConceptScheme

Laube (Erschließung)
preferred label: gallery of arcades @en
preferred label: galerie d\'arcades @fr
preferred label: podloubí @cs
type: NamedIndividual
type: Concept
related: Galerie (Erschließung)

Loggia
preferred label: logia @es
preferred label: loggia @it
preferred label: lodžie @cs
type: NamedIndividual
type: Concept
related: Galerie (Erschließung)

Quellennachweis Koch 2008
type: NamedIndividual
type: ConceptScheme

Bamberger Vokabular für Historische Architektur
type: NamedIndividual
type: ConceptScheme

Verbindungsbau
type: NamedIndividual
type: Concept
narrower: Galerie (Erschließung)