Quellennachweis Koepf / Binding 2016
type: NamedIndividual
type: ConceptScheme

Wehrelement
type: NamedIndividual
type: Concept
narrower: Riegelbalken

Strukturtypen
type: NamedIndividual
type: ConceptScheme

Riegelbalken
definition: Riegelbalken, Sperrbalken, Klemmbalken, Verschlussbalken, zum Verschließen eines Tors dienender Balken; er läuft in seitl. Mauerschlitzen, wird in Mauerlöcher zurückgeschoben oder ist in Klauen eingehängt. [Koepf / Binding 2016]
definition: Ein in einen Mauerkanal einschiebbarer Balken, der bei geschlossenem Tor auf der Innenseite über dieses hinweg in eine entsprechende Maueraussparung geschoben wird und dadurch die Torflügel auch gegen kräftigen Druck sichert. [Koepf/Binding 2016]
type: Concept
type: NamedIndividual
broader: Wehrelement
preferred label: chiavaccio @it
preferred label: tranca @es
preferred label: épar(t) @fr
preferred label: cross beam @en
alternative label: Sperrbalken
alternative label: spranga di legno @it
alternative label: Balkenriegel
alternative label: traverse @fr
alternative label: Verschlussbalken
alternative label: catenaccio @it
alternative label: rail beam @en
alternative label: barra @es
alternative label: travesaño @es
alternative label: barre @fr
alternative label: Klemmbalken
created: 2020-08-21T13:15:35
in scheme: Strukturtypen
in scheme: Bamberger Vokabular für Historische Architektur
in scheme: Quellennachweis Koepf / Binding 2016
modified: 2021-01-25T13:02:21

Bamberger Vokabular für Historische Architektur
type: NamedIndividual
type: ConceptScheme