Quellennachweis Koch 2009
type: NamedIndividual
type: ConceptScheme

Mauer
narrower: Schildmauer
type: NamedIndividual
type: Concept
preferred label: mur @fr
preferred label: muro @it
preferred label: murus @la
preferred label: zeď @cs
preferred label: wall @en

Strukturtypen
type: NamedIndividual
type: ConceptScheme

Schildmauer
alternative label: mur de clôture @fr
alternative label: muro frontal @es
alternative label: štítová zed\' @cs
alternative label: curtain wall @en
alternative label: braga @it
alternative label: Schildwand
alternative label: vysoká hradní hradba @cs
type: Concept
type: NamedIndividual
definition: Eine herausragend hoch und stark ausgeführte Mauer an einer besonders gefährdeten Seite. Meist kommt sie bei Sporn- oder Hangburgen mit einer deutlichen Überhöhung zur Feindseite hin vor. Nach anfänglichen feindseitigen Verstärkungen der Ringmauer im frühen Burgenbau hat sich die Sch. im Laufe der 2. Hälfte des 12. Jhs. und vor allem im 13. Jh. – vielleicht auch als eine Reaktion auf die aufkommenden Bliden – als eigenständiges Bauwerk herausgebildet, das meist die hinter ihr liegenden Gebäude der Kernburg abdeckte. Ihre Blütezeit war die 2. Hälfte des 13. und das 14. Jh., als vorwiegend in Südwestdeutschland, der Pfalz und im Mittelrheingebiet zahlreiche Burgen mit Sch.n (Schildmauerburgen) entstanden. Während die Mauerstärke zwischen 2–4 m, vereinzelt bei bis zu 5 m lag, schwanken die Längen der Sch.n beträchtlich, entsprechend der Länge des zu schützenden Bereiches. Auch ihre Höhe ist uneinheitlich, häufig werden über 20 m, bisweilen rund 30 m Höhe erreicht. Sie kann dabei als geradliniger Querriegel die Angriffsseite absichern, mehrfach gewinkelt (Sterrenberg RP) oder spitzwinklig (Burgschwalbach; Trutzeltz RP) sein. Schwierig ist in Grenzfällen (Schönburg/Oberwesel RP) die terminologische Abgrenzung zur Mantelmauer. Oft wurde die Sch. mit einem Bergfried kombiniert, wobei dieser mittig (Frontturmburg; Gräfenstein RP, Wildburg BY) oder flankierend an der Seite platziert sein konnte. Besonders eindrucksvoll sind von zwei Türmen eingefasste Sch.n (Ehrenfels HE, Reichenberg RP), als reduzierte Ausführung konnten an den Mauerenden Tourellen aufgesetzt sein (Greifenstein HE). Gelegentlich konnte eine Sch. die Funktionen des Bergfrieds – auch dessen repräsentative und symbolische Wirkung – übernehmen. Meist war die Kernburg, manchmal nur die Vorburg (Sterrenberg RP) durch eine Sch. gesichert, in wenigen Fällen waren auch zwei (unterschiedlich alte) S.n hintereinander gestaffelt (Sterrenberg RP). Ein wesentlicher Schutzfaktor war die enorme, gelegentlich durch Stütz- o…
definition: Zeď pod čelním obloukem. [Koch 2008] @cs
definition: Stirnmauer; 1. Mauer unter dem Schildbogen; 2. verstärkte Mauer einer Burg. Vorgeschildet ist eine Mauer, hinter der sich kein umbauter Raum befindet, vgl. London, St. Paul\'s. [Koch 2009]
definition: 1. Mauer unter einem Schildbogen (Gewölbe). 2. Hohe Schutzmauer einer Burg, die an der Stelle angeordnet ist, an der das Gelände höher ansteigt. [Koepf /Binding 2016]
preferred label: čelní zeď @cs
preferred label: mur bouclier @fr
preferred label: muro frontale @it
created: 2020-04-28T17:23:53
in scheme: Strukturtypen
in scheme: Bamberger Vokabular für Historische Architektur
in scheme: Quellennachweis Koch 2009
in scheme: Quellennachweis Koch 2008
modified: 2021-01-22T15:38:29
broader by function: Mauer
broader: Mauer

Quellennachweis Koch 2008
type: NamedIndividual
type: ConceptScheme

Bamberger Vokabular für Historische Architektur
type: NamedIndividual
type: ConceptScheme