Verschmutzung
scope note: Relationship with the substrate : With soiling, the substrate stucture is not considered as affect - ed. Soiling may have different degrees of adhesion to the substrate. [ICOMOS-ISCS] @en
scope note: Beziehungen zum Substrat: Bei einer Verschmutzung wird die Struktur des Substrats nicht angegriffen. Die Verschmutzung kann unterschiedlich stark am Substrat haften.[ICOMOS-ISCS]
broader: umweltbedingte Schädigung
broader: vom Menschen verursachte Schädigung
broader: Schaden der Architekturoberfläche
in scheme: Bamberger Vokabular für Historische Architektur
in scheme: Begriffe für den Themenkomplex Sakralbau
in scheme: Quellennachweis ICOMOS-ISCS
in scheme: Quellennachweis EwaGlos
alternative label: Kontamination
alternative label: dirt @en
alternative label: Verunreinigung
alternative label: Schmutz
alternative label: Dreck
alternative label: salissure @fr
definition: Ablagerung einer sehr dünnen Schicht von Fremd - partikeln (z. B. Ruß), welche der Stein ober fläche ein schmutziges Aussehen verleihen. [ICOMOS-ISCS]
definition: Deposit of a very thin layer of exogenous particles (eg. soot) giving a dirty appearance to the stone surface. [ICOMOS-ISCS] @en
definition: Dépôt très fin de particules exogènes (par ex. poussières, suies) donnant un aspect sale à la surface de pierre. [ICOMOS-ISCS] @fr
definition: znečištění, špinění je uložení velmi tenké vrstvy exogenních částic (např. sazí), dávající povrchu kamene špinavý vzhled. [ICOMOS-ISCS] @cs
definition: The accumulation of extraneous material on a surface leading to discolouration. [EwaGlos] @en
definition: Externe Faktoren, die natürlich oder anthropogen sein können, verursachen Zerfall. [EwaGlos]
modified: 2021-01-15T17:58:58
created: 2019-07-05T21:46:32
type: Concept
type: NamedIndividual
preferred label: znečištění @cs
preferred label: soiling @en
preferred label: encrassement @fr

Quellennachweis ICOMOS-ISCS
type: NamedIndividual
type: ConceptScheme

Schaden der Architekturoberfläche
type: NamedIndividual
type: Concept
narrower: Verschmutzung

Begriffe für den Themenkomplex Sakralbau
type: NamedIndividual
type: ConceptScheme

vom Menschen verursachte Schädigung
preferred label: anthropically induced deterioration @en
type: NamedIndividual
type: Concept
narrower: Verschmutzung

umweltbedingte Schädigung
preferred label: environmental deterioration @en
type: NamedIndividual
type: Concept
narrower: Verschmutzung

Quellennachweis EwaGlos
type: NamedIndividual
type: ConceptScheme

Bamberger Vokabular für Historische Architektur
type: NamedIndividual
type: ConceptScheme